{"text_format":"1","workbook":"xlsx","n_sheets":8,"sheets":["Start Original","Finish Original","Créditos","Start y Finish","Evacuación","Calidad en Salas","Control de Número de Asistentes","Firmas y Control documental"],"not_rendered":{"charts":0,"images":7,"macros":1,"external_links":1,"defined_names":10,"comments":0,"pivot_tables":0},"unopened":[],"bounds":{"document_bytes":16777216,"sheet_cells":100000,"rows_first":2000,"rows_last":500,"rows_between":2000,"halvings":0,"cell_chars":16384,"cell_head_chars":4096},"cells_cut":0,"cells_raw":0,"read":"whole","date_system":"1900"}

{"sheet":"Start Original","index":0,"n_rows":0,"n_cols":0,"rows_kept":0,"cut":false,"hidden":false,"merged":[]}

{"sheet":"Finish Original","index":1,"n_rows":0,"n_cols":0,"rows_kept":0,"cut":false,"hidden":false,"merged":[]}

{"sheet":"Créditos","index":2,"n_rows":109,"n_cols":8,"rows_kept":109,"cut":false,"hidden":false,"merged":[[3,1,3,3],[0,0,2,3]]}
["Inicio de Créditos",null,null,null,null,null,"AVE","Avellaneda"]
[null,null,null,null,null,null,"CAB","Caballito"]
[null,null,null,null,null,null,"LUJ","Luján"]
["Complejo:",{"$f":"IFERROR(VLOOKUP(IF('Start Original'!E3=\"\",\"\",MID('Start Original'!E3,11,3)),$G$1:$H$11,2,FALSE),\"\")","v":""},null,null,null,null,"ARE","Maipú"]
["Semana desde:",null,"hasta:",null,null,null,"MEN","Mendoza"]
[null,null,null,null,null,null,"MER","Merlo"]
["Película","Duración","Inicio\nCréditos","Tiempo Créditos",null,null,"NEU","Neuquén"]
[null,null,null,{"$f":"IF(C8=\"\",\"\",B8-C8)","v":""},null,null,"PIL","Pilar"]
[null,null,null,{"$f":"IF(C9=\"\",\"\",B9-C9)","v":""},null,null,"REC","Recoleta"]
[null,null,null,"",null,null,"ROS","Rosario"]
[null,null,null,""]
[null,null,null,""]
[null,null,null,""]
[null,null,null,""]
[null,null,null,""]
[null,null,null,""]
[null,null,null,""]
[null,null,null,""]
[null,null,null,""]
[null,null,null,""]
{"$rows_left_out":90}
{"sheet":"Start y Finish","index":3,"n_rows":114,"n_cols":16,"rows_kept":114,"cut":false,"hidden":false,"merged":[[7,7,7,12],[7,0,7,5],[0,0,4,12],[5,0,5,3],[5,4,5,5],[5,7,5,11]]}
[null,null,null,null,null,null,null,null,null,null,null,null,null,null,"AVE","Avellaneda"]
[null,null,null,null,null,null,null,null,null,null,null,null,null,null,"CAB","Caballito"]
[null,null,null,null,null,null,null,null,null,null,null,null,null,null,"LUJ","Luján"]
[null,null,null,null,null,null,null,null,null,null,null,null,null,null,"ARE","Maipú"]
[null,null,null,null,null,null,null,null,null,null,null,null,null,null,"MEN","Mendoza"]
["Complejo:",null,null,null,{"$f":"IFERROR(VLOOKUP(IF('Start Original'!E3=\"\",\"\",MID('Start Original'!E3,11,3)),$O$1:$P$11,2,FALSE),\"\")","v":""},null,null,"Fecha:",null,null,null,null,{"$f":"IF('Start Original'!A2=\"\",\"\",('Start Original'!A2))","v":""},null,"MER","Merlo"]
[null,null,null,null,null,null,null,null,null,null,null,null,null,null,"NEU","Neuquén"]
["INICIO - START",null,null,null,null,null,null,"FINAL - FINISH",null,null,null,null,null,null,"PIL","Pilar"]
["Inicio Función","Inicio Película","Final Función","Sala","Película","Calif.",null,"Final Película","Tiempo Créditos","Final Función","Inicio Función","Sala","Película",null,"REC","Recoleta"]
[{"$f":"IF('Start Original'!C3=\"\",\"\",'Start Original'!A3)","v":""},{"$f":"IF('Start Original'!D3=\"\",\"\",'Start Original'!B3)","v":""},{"$f":"IF('Start Original'!B3=\"\",\"\",'Start Original'!C3)","v":""},{"$f":"IF('Start Original'!B3=\"\",\"\",IFERROR(IF(OR($E$6=\"Rosario\",$E$6=\"Mendoza\",$E$6=\"Avellaneda\",$E$6=\"Recoleta\"),RIGHT('Start Original'!E3,2),RIGHT('Start Original'!E3,1)),\"\"))","v":""},{"$f":"IF('Start Original'!B3=\"\",\"\",'Start Original'!F3)","v":""},{"$f":"+'Start Original'!I3","v":0},null,{"$f":"IF('Finish Original'!B3=\"\",\"\",J10-I10)","v":""},{"$f":"IF('Finish Original'!B3=\"\",\"\",VLOOKUP(M10,Créditos!$A$8:$D$67,4,FALSE))","v":""},{"$f":"+'Finish Original'!A3","v":"00:00:00"},{"$f":"IF('Finish Original'!B3=\"\",\"\",'Finish Original'!C3)","v":""},{"$f":"IF('Finish Original'!B3=\"\",\"\",IFERROR(IF(OR($E$6=\"Rosario\",$E$6=\"Mendoza\",$E$6=\"Avellaneda\",$E$6=\"Recoleta\"),RIGHT('Finish Original'!E3,2),RIGHT('Finish Original'!E3,1)),\"\"))","v":""},{"$f":"IF('Finish Original'!B3=\"\",\"\",'Finish Original'!F3)","v":""},null,"ROS","Rosario"]
[{"$f":"IF('Start Original'!C4=\"\",\"\",'Start Original'!A4)","v":""},{"$f":"IF('Start Original'!D4=\"\",\"\",'Start Original'!B4)","v":""},{"$f":"IF('Start Original'!B4=\"\",\"\",'Start Original'!C4)","v":""},{"$f":"IF('Start Original'!B4=\"\",\"\",IFERROR(IF(OR($E$6=\"Rosario\",$E$6=\"Mendoza\",$E$6=\"Avellaneda\",$E$6=\"Recoleta\"),RIGHT('Start Original'!E4,2),RIGHT('Start Original'!E4,1)),\"\"))","v":""},{"$f":"IF('Start Original'!B4=\"\",\"\",'Start Original'!F4)","v":""},{"$f":"+'Start Original'!I4","v":0},null,{"$f":"IF('Finish Original'!B4=\"\",\"\",J11-I11)","v":""},{"$f":"IF('Finish Original'!B4=\"\",\"\",VLOOKUP(M11,Créditos!$A$8:$D$67,4,FALSE))","v":""},{"$f":"+'Finish Original'!A4","v":"00:00:00"},{"$f":"IF('Finish Original'!B4=\"\",\"\",'Finish Original'!C4)","v":""},{"$f":"IF('Finish Original'!B4=\"\",\"\",IFERROR(IF(OR($E$6=\"Rosario\",$E$6=\"Mendoza\",$E$6=\"Avellaneda\",$E$6=\"Recoleta\"),RIGHT('Finish Original'!E4,2),RIGHT('Finish Original'!E4,1)),\"\"))","v":""},{"$f":"IF('Finish Original'!B4=\"\",\"\",'Finish Original'!F4)","v":""}]
[{"$f":"IF('Start Original'!C5=\"\",\"\",'Start Original'!A5)","v":""},{"$f":"IF('Start Original'!D5=\"\",\"\",'Start Original'!B5)","v":""},{"$f":"IF('Start Original'!B5=\"\",\"\",'Start Original'!C5)","v":""},{"$f":"IF('Start Original'!B5=\"\",\"\",IFERROR(IF(OR($E$6=\"Rosario\",$E$6=\"Mendoza\",$E$6=\"Avellaneda\",$E$6=\"Recoleta\"),RIGHT('Start Original'!E5,2),RIGHT('Start Original'!E5,1)),\"\"))","v":""},{"$f":"IF('Start Original'!B5=\"\",\"\",'Start Original'!F5)","v":""},{"$f":"+'Start Original'!I5","v":0},null,{"$f":"IF('Finish Original'!B5=\"\",\"\",J12-I12)","v":""},{"$f":"IF('Finish Original'!B5=\"\",\"\",VLOOKUP(M12,Créditos!$A$8:$D$67,4,FALSE))","v":""},{"$f":"+'Finish Original'!A5","v":"00:00:00"},{"$f":"IF('Finish Original'!B5=\"\",\"\",'Finish Original'!C5)","v":""},{"$f":"IF('Finish Original'!B5=\"\",\"\",IFERROR(IF(OR($E$6=\"Rosario\",$E$6=\"Mendoza\",$E$6=\"Avellaneda\",$E$6=\"Recoleta\"),RIGHT('Finish Original'!E5,2),RIGHT('Finish Original'!E5,1)),\"\"))","v":""},{"$f":"IF('Finish Original'!B5=\"\",\"\",'Finish Original'!F5)","v":""}]
[{"$f":"IF('Start Original'!C6=\"\",\"\",'Start Original'!A6)","v":""},{"$f":"IF('Start Original'!D6=\"\",\"\",'Start Original'!B6)","v":""},{"$f":"IF('Start Original'!B6=\"\",\"\",'Start Original'!C6)","v":""},{"$f":"IF('Start Original'!B6=\"\",\"\",IFERROR(IF(OR($E$6=\"Rosario\",$E$6=\"Mendoza\",$E$6=\"Avellaneda\",$E$6=\"Recoleta\"),RIGHT('Start Original'!E6,2),RIGHT('Start Original'!E6,1)),\"\"))","v":""},{"$f":"IF('Start Original'!B6=\"\",\"\",'Start Original'!F6)","v":""},{"$f":"+'Start Original'!I6","v":0},null,{"$f":"IF('Finish Original'!B6=\"\",\"\",J13-I13)","v":""},{"$f":"IF('Finish Original'!B6=\"\",\"\",VLOOKUP(M13,Créditos!$A$8:$D$67,4,FALSE))","v":""},{"$f":"+'Finish Original'!A6","v":"00:00:00"},{"$f":"IF('Finish Original'!B6=\"\",\"\",'Finish Original'!C6)","v":""},{"$f":"IF('Finish Original'!B6=\"\",\"\",IFERROR(IF(OR($E$6=\"Rosario\",$E$6=\"Mendoza\",$E$6=\"Avellaneda\",$E$6=\"Recoleta\"),RIGHT('Finish Original'!E6,2),RIGHT('Finish Original'!E6,1)),\"\"))","v":""},{"$f":"IF('Finish Original'!B6=\"\",\"\",'Finish Original'!F6)","v":""}]
[{"$f":"IF('Start Original'!C7=\"\",\"\",'Start Original'!A7)","v":""},{"$f":"IF('Start Original'!D7=\"\",\"\",'Start Original'!B7)","v":""},{"$f":"IF('Start Original'!B7=\"\",\"\",'Start Original'!C7)","v":""},{"$f":"IF('Start Original'!B7=\"\",\"\",IFERROR(IF(OR($E$6=\"Rosario\",$E$6=\"Mendoza\",$E$6=\"Avellaneda\",$E$6=\"Recoleta\"),RIGHT('Start Original'!E7,2),RIGHT('Start Original'!E7,1)),\"\"))","v":""},{"$f":"IF('Start Original'!B7=\"\",\"\",'Start Original'!F7)","v":""},{"$f":"+'Start Original'!I7","v":0},null,{"$f":"IF('Finish Original'!B7=\"\",\"\",J14-I14)","v":""},{"$f":"IF('Finish Original'!B7=\"\",\"\",VLOOKUP(M14,Créditos!$A$8:$D$67,4,FALSE))","v":""},{"$f":"+'Finish Original'!A7","v":"00:00:00"},{"$f":"IF('Finish Original'!B7=\"\",\"\",'Finish Original'!C7)","v":""},{"$f":"IF('Finish Original'!B7=\"\",\"\",IFERROR(IF(OR($E$6=\"Rosario\",$E$6=\"Mendoza\",$E$6=\"Avellaneda\",$E$6=\"Recoleta\"),RIGHT('Finish Original'!E7,2),RIGHT('Finish Original'!E7,1)),\"\"))","v":""},{"$f":"IF('Finish Original'!B7=\"\",\"\",'Finish Original'!F7)","v":""}]
[{"$f":"IF('Start Original'!C8=\"\",\"\",'Start Original'!A8)","v":""},{"$f":"IF('Start Original'!D8=\"\",\"\",'Start Original'!B8)","v":""},{"$f":"IF('Start Original'!B8=\"\",\"\",'Start Original'!C8)","v":""},{"$f":"IF('Start Original'!B8=\"\",\"\",IFERROR(IF(OR($E$6=\"Rosario\",$E$6=\"Mendoza\",$E$6=\"Avellaneda\",$E$6=\"Recoleta\"),RIGHT('Start Original'!E8,2),RIGHT('Start Original'!E8,1)),\"\"))","v":""},{"$f":"IF('Start Original'!B8=\"\",\"\",'Start Original'!F8)","v":""},{"$f":"+'Start Original'!I8","v":0},null,{"$f":"IF('Finish Original'!B8=\"\",\"\",J15-I15)","v":""},{"$f":"IF('Finish Original'!B8=\"\",\"\",VLOOKUP(M15,Créditos!$A$8:$D$67,4,FALSE))","v":""},{"$f":"+'Finish Original'!A8","v":"00:00:00"},{"$f":"IF('Finish Original'!B8=\"\",\"\",'Finish Original'!C8)","v":""},{"$f":"IF('Finish Original'!B8=\"\",\"\",IFERROR(IF(OR($E$6=\"Rosario\",$E$6=\"Mendoza\",$E$6=\"Avellaneda\",$E$6=\"Recoleta\"),RIGHT('Finish Original'!E8,2),RIGHT('Finish Original'!E8,1)),\"\"))","v":""},{"$f":"IF('Finish Original'!B8=\"\",\"\",'Finish Original'!F8)","v":""}]
[{"$f":"IF('Start Original'!C9=\"\",\"\",'Start Original'!A9)","v":""},{"$f":"IF('Start Original'!D9=\"\",\"\",'Start Original'!B9)","v":""},{"$f":"IF('Start Original'!B9=\"\",\"\",'Start Original'!C9)","v":""},{"$f":"IF('Start Original'!B9=\"\",\"\",IFERROR(IF(OR($E$6=\"Rosario\",$E$6=\"Mendoza\",$E$6=\"Avellaneda\",$E$6=\"Recoleta\"),RIGHT('Start Original'!E9,2),RIGHT('Start Original'!E9,1)),\"\"))","v":""},{"$f":"IF('Start Original'!B9=\"\",\"\",'Start Original'!F9)","v":""},{"$f":"+'Start Original'!I9","v":0},null,{"$f":"IF('Finish Original'!B9=\"\",\"\",J16-I16)","v":""},{"$f":"IF('Finish Original'!B9=\"\",\"\",VLOOKUP(M16,Créditos!$A$8:$D$67,4,FALSE))","v":""},{"$f":"+'Finish Original'!A9","v":"00:00:00"},{"$f":"IF('Finish Original'!B9=\"\",\"\",'Finish Original'!C9)","v":""},{"$f":"IF('Finish Original'!B9=\"\",\"\",IFERROR(IF(OR($E$6=\"Rosario\",$E$6=\"Mendoza\",$E$6=\"Avellaneda\",$E$6=\"Recoleta\"),RIGHT('Finish Original'!E9,2),RIGHT('Finish Original'!E9,1)),\"\"))","v":""},{"$f":"IF('Finish Original'!B9=\"\",\"\",'Finish Original'!F9)","v":""}]
[{"$f":"IF('Start Original'!C10=\"\",\"\",'Start Original'!A10)","v":""},{"$f":"IF('Start Original'!D10=\"\",\"\",'Start Original'!B10)","v":""},{"$f":"IF('Start Original'!B10=\"\",\"\",'Start Original'!C10)","v":""},{"$f":"IF('Start Original'!B10=\"\",\"\",IFERROR(IF(OR($E$6=\"Rosario\",$E$6=\"Mendoza\",$E$6=\"Avellaneda\",$E$6=\"Recoleta\"),RIGHT('Start Original'!E10,2),RIGHT('Start Original'!E10,1)),\"\"))","v":""},{"$f":"IF('Start Original'!B10=\"\",\"\",'Start Original'!F10)","v":""},{"$f":"+'Start Original'!I10","v":0},null,{"$f":"IF('Finish Original'!B10=\"\",\"\",J17-I17)","v":""},{"$f":"IF('Finish Original'!B10=\"\",\"\",VLOOKUP(M17,Créditos!$A$8:$D$67,4,FALSE))","v":""},{"$f":"+'Finish Original'!A10","v":"00:00:00"},{"$f":"IF('Finish Original'!B10=\"\",\"\",'Finish Original'!C10)","v":""},{"$f":"IF('Finish Original'!B10=\"\",\"\",IFERROR(IF(OR($E$6=\"Rosario\",$E$6=\"Mendoza\",$E$6=\"Avellaneda\",$E$6=\"Recoleta\"),RIGHT('Finish Original'!E10,2),RIGHT('Finish Original'!E10,1)),\"\"))","v":""},{"$f":"IF('Finish Original'!B10=\"\",\"\",'Finish Original'!F10)","v":""}]
[{"$f":"IF('Start Original'!C11=\"\",\"\",'Start Original'!A11)","v":""},{"$f":"IF('Start Original'!D11=\"\",\"\",'Start Original'!B11)","v":""},{"$f":"IF('Start Original'!B11=\"\",\"\",'Start Original'!C11)","v":""},{"$f":"IF('Start Original'!B11=\"\",\"\",IFERROR(IF(OR($E$6=\"Rosario\",$E$6=\"Mendoza\",$E$6=\"Avellaneda\",$E$6=\"Recoleta\"),RIGHT('Start Original'!E11,2),RIGHT('Start Original'!E11,1)),\"\"))","v":""},{"$f":"IF('Start Original'!B11=\"\",\"\",'Start Original'!F11)","v":""},{"$f":"+'Start Original'!I11","v":0},null,{"$f":"IF('Finish Original'!B11=\"\",\"\",J18-I18)","v":""},{"$f":"IF('Finish Original'!B11=\"\",\"\",VLOOKUP(M18,Créditos!$A$8:$D$67,4,FALSE))","v":""},{"$f":"+'Finish Original'!A11","v":"00:00:00"},{"$f":"IF('Finish Original'!B11=\"\",\"\",'Finish Original'!C11)","v":""},{"$f":"IF('Finish Original'!B11=\"\",\"\",IFERROR(IF(OR($E$6=\"Rosario\",$E$6=\"Mendoza\",$E$6=\"Avellaneda\",$E$6=\"Recoleta\"),RIGHT('Finish Original'!E11,2),RIGHT('Finish Original'!E11,1)),\"\"))","v":""},{"$f":"IF('Finish Original'!B11=\"\",\"\",'Finish Original'!F11)","v":""}]
[{"$f":"IF('Start Original'!C12=\"\",\"\",'Start Original'!A12)","v":""},{"$f":"IF('Start Original'!D12=\"\",\"\",'Start Original'!B12)","v":""},{"$f":"IF('Start Original'!B12=\"\",\"\",'Start Original'!C12)","v":""},{"$f":"IF('Start Original'!B12=\"\",\"\",IFERROR(IF(OR($E$6=\"Rosario\",$E$6=\"Mendoza\",$E$6=\"Avellaneda\",$E$6=\"Recoleta\"),RIGHT('Start Original'!E12,2),RIGHT('Start Original'!E12,1)),\"\"))","v":""},{"$f":"IF('Start Original'!B12=\"\",\"\",'Start Original'!F12)","v":""},{"$f":"+'Start Original'!I12","v":0},null,{"$f":"IF('Finish Original'!B12=\"\",\"\",J19-I19)","v":""},{"$f":"IF('Finish Original'!B12=\"\",\"\",VLOOKUP(M19,Créditos!$A$8:$D$67,4,FALSE))","v":""},{"$f":"+'Finish Original'!A12","v":"00:00:00"},{"$f":"IF('Finish Original'!B12=\"\",\"\",'Finish Original'!C12)","v":""},{"$f":"IF('Finish Original'!B12=\"\",\"\",IFERROR(IF(OR($E$6=\"Rosario\",$E$6=\"Mendoza\",$E$6=\"Avellaneda\",$E$6=\"Recoleta\"),RIGHT('Finish Original'!E12,2),RIGHT('Finish Original'!E12,1)),\"\"))","v":""},{"$f":"IF('Finish Original'!B12=\"\",\"\",'Finish Original'!F12)","v":""}]
[{"$f":"IF('Start Original'!C13=\"\",\"\",'Start Original'!A13)","v":""},{"$f":"IF('Start Original'!D13=\"\",\"\",'Start Original'!B13)","v":""},{"$f":"IF('Start Original'!B13=\"\",\"\",'Start Original'!C13)","v":""},{"$f":"IF('Start Original'!B13=\"\",\"\",IFERROR(IF(OR($E$6=\"Rosario\",$E$6=\"Mendoza\",$E$6=\"Avellaneda\",$E$6=\"Recoleta\"),RIGHT('Start Original'!E13,2),RIGHT('Start Original'!E13,1)),\"\"))","v":""},{"$f":"IF('Start Original'!B13=\"\",\"\",'Start Original'!F13)","v":""},{"$f":"+'Start Original'!I13","v":0},null,{"$f":"IF('Finish Original'!B13=\"\",\"\",J20-I20)","v":""},{"$f":"IF('Finish Original'!B13=\"\",\"\",VLOOKUP(M20,Créditos!$A$8:$D$67,4,FALSE))","v":""},{"$f":"+'Finish Original'!A13","v":"00:00:00"},{"$f":"IF('Finish Original'!B13=\"\",\"\",'Finish Original'!C13)","v":""},{"$f":"IF('Finish Original'!B13=\"\",\"\",IFERROR(IF(OR($E$6=\"Rosario\",$E$6=\"Mendoza\",$E$6=\"Avellaneda\",$E$6=\"Recoleta\"),RIGHT('Finish Original'!E13,2),RIGHT('Finish Original'!E13,1)),\"\"))","v":""},{"$f":"IF('Finish Original'!B13=\"\",\"\",'Finish Original'!F13)","v":""}]
{"$rows_left_out":95}
{"sheet":"Evacuación","index":4,"n_rows":59,"n_cols":20,"rows_kept":59,"cut":false,"hidden":false,"merged":[[57,3,57,4],[58,3,58,4],[51,3,51,4],[52,3,52,4],[54,3,54,4],[53,3,53,4],[45,3,45,4],[47,3,47,4],[48,3,48,4],[49,3,49,4],[56,3,56,4],[39,3,39,4],[40,3,40,4],[42,3,42,4],[43,3,43,4],[44,3,44,4],[34,3,34,4],[35,3,35,4],[36,3,36,4],[37,3,37,4],[38,3,38,4],[29,3,29,4],[30,3,30,4],[31,3,31,4],[32,3,32,4],[33,3,33,4],[24,3,24,4],[25,3,25,4],[26,3,26,4],[27,3,27,4],[28,3,28,4],[19,3,19,4],[20,3,20,4],[21,3,21,4],[22,3,22,4],[23,3,23,4],[56,0,58,0],[56,1,56,2],[57,1,57,2],[58,1,58,2],[51,0,54,0],[51,1,51,2],[52,1,52,2],[53,1,53,2],[54,1,54,2],[47,0,49,0],[47,1,47,2],[48,1,48,2],[49,1,49,2],[12,4,12,5],[13,4,13,5],[14,4,14,5],[15,4,15,5],[17,4,17,5],[19,0,40,0],[20,1,40,1],[42,0,45,0],[42,1,42,2],[43,1,43,2],[44,1,44,2],[45,1,45,2],[0,0,3,5],[16,4,16,5],[11,4,11,5],[7,3,7,5],[8,4,8,5],[9,4,9,5],[10,4,10,5]]}
["Responsabilidades de Evacuación",null,null,null,null,null,null,null,"Avellaneda","Avellaneda","Houssay","Luján","Maipú","Mendoza","Merlo","Neuquén","Pilar","Recoleta","Rosario","-"]
[null,null,null,null,null,null,null,null,"Houssay",1,1,1,1,1,1,1,1,1,1,"-"]
[null,null,null,null,null,null,null,null,"Luján",2,2,2,2,2,2,2,2,2,2,"-"]
[null,null,null,null,null,null,null,null,"Maipú",3,3,3,3,3,3,3,3,3,3,"-"]
[null,null,null,null,null,null,null,null,"Mendoza",4,4,4,4,4,4,4,4,4,4,"-"]
["Complejo:",{"$f":"+'Start y Finish'!E6","v":""},"Fecha:",{"$f":"+'Start y Finish'!M6","v":""},"Responsable:",null,null,null,"Merlo",5,"-",5,5,5,5,5,5,5,5,"-"]
[null,null,null,null,null,null,null,null,"Neuquén",6,"-",6,"-",6,6,6,6,6,6,"-"]
["Posición","Cargo","Nombre","Claves",null,null,null,null,"Pilar",7,"-","-","-",7,"-",7,7,7,7,"-"]
[1,"Gerente ",null,"Clave A","Radio que modula tiene prioridad",null,null,null,"Recoleta",8,"-","-","-",8,"-","-",8,8,8,"-"]
[2,"Subgerente ",null,"Código Blanco","No se observa anormalidad en lugar",null,null,null,"Rosario",10,"-","-","-",9,"-","-",9,9,9,"-"]
[3,"Manager",null,"Código Gris","Se observa humo",null,null,null,"-",11,"-","-","-",10,"-","-","-",10,10,"-"]
[4,"Floor",null,"Código Rojo","Se observa fuego",null,null,null,null,12,"-","-","-","-","-","-","-","-",11,"-"]
[5,"Floor",null,"Código Negro","Amenaza de elemento explosivo",null,null,null,null,13,"-","-","-","-","-","-","-","-",12,"-"]
[6,"Candy",null,"Código Azul","Se necesitan primeros auxilios",null,null,null,null,14,"-","-","-","-","-","-","-","-",14,"-"]
[7,"Candy",null,"Código Amarillo","Escape de gas",null,null,null,null,15,"-","-","-","-","-","-","-","-","-","-"]
[8,"Of calificado ",null,null,null,null,null,null,null,16,"-","-","-","-","-","-","-","-","-","-"]
[9,null,null,null,null,null,null,null,null,"-","-","-","-","-","-","-","-","-","-","-"]
[10]
[]
["Salas / Floor","Deberes","Sala/Área","Staff Floor AM",null,"Staff Floor PM"]
{"$rows_left_out":40}
{"sheet":"Calidad en Salas","index":5,"n_rows":31,"n_cols":15,"rows_kept":31,"cut":false,"hidden":false,"merged":[[30,2,30,4],[6,10,6,12],[27,10,27,12],[9,10,9,12],[30,10,30,12],[29,1,29,5],[29,9,29,13],[26,0,26,1],[26,2,26,5],[26,8,26,9],[26,10,26,13],[27,2,27,4],[23,0,24,5],[23,8,24,13],[2,0,3,5],[0,0,1,5],[0,8,1,13],[2,8,3,13],[21,0,22,5],[21,8,22,13],[5,8,5,9],[5,10,5,13],[5,0,5,1],[5,2,5,5],[8,1,8,5],[8,9,8,13],[9,2,9,4],[6,2,6,4]]}
["Formatos de Control de Salas\nAR-TRA-FT-FCS-03",null,null,null,null,null,null,null,"Formatos de Control de Salas\nAR-TRA-FT-FCS-03",null,null,null,null,null,"Avellaneda"]
[null,null,null,null,null,null,null,null,null,null,null,null,null,null,"Caballito"]
["Bitácora de Calidad en Salas",null,null,null,null,null,null,null,"Bitácora de Calidad en Salas",null,null,null,null,null,"Luján"]
[null,null,null,null,null,null,null,null,null,null,null,null,null,null,"Maipú"]
[null,null,null,null,null,null,null,null,null,null,null,null,null,null,"Mendoza"]
["Complejo:",null,{"$f":"+'Start y Finish'!E6","v":""},null,null,null,null,null,"Complejo:",null,{"$f":"+IF($C$6=\"\",\"\",$C$6)","v":""},null,null,null,"Merlo"]
["Fecha",null,"Sala",null,null,null,null,null,"Fecha",null,"Sala",null,null,null,"Neuquén"]
[null,null,null,null,null,null,null,null,null,null,null,null,null,null,"Pilar"]
[null,"Firma de responsable de verificación de calidad en salas",null,null,null,null,null,null,null,"Firma de responsable de verificación de calidad en salas"]
["Hora Función","Inicio","Medio",null,null,"Finalización",null,null,"Hora Función","Inicio","Medio",null,null,"Finalización","Recoleta"]
[null,null,null,null,null,null,null,null,null,null,null,null,null,null,"Rosario"]
[]
[]
[]
[]
[]
[]
[]
[]
[]
{"$rows_left_out":12}
{"sheet":"Control de Número de Asistentes","index":6,"n_rows":14,"n_cols":7,"rows_kept":14,"cut":false,"hidden":false,"merged":[[11,0,11,6],[6,0,6,6],[7,0,7,6],[8,0,8,6],[9,0,9,6],[10,0,10,6],[0,0,0,6],[2,0,2,2],[4,0,4,6],[5,0,5,6],[2,3,2,6]]}
["Bitácora de Control de Número de Asistentes"]
[]
["Complejo:",null,null,{"$f":"+'Start y Finish'!E6","v":""}]
[]
["Instrucciones"]
["Aplicar esta bitácora diariamente en el 30% de las funciones. Podrá hacerse por el líder de cuadrilla, subgerente, gerente asistente o gerente de complejo siguiendo estos pasos:"]
["1. Colocar \"Fecha\" y \"Sala\" a revisar en las columnas correspondientes  (al culminar el día invalidar el siguiente renglón y utilizar el próximo al día siguiente)"]
["2. Anotar el horario de la función a revisar en la columna \"Horario\""]
["3. Anotar el número de \"Clientes Admitidos\" según la tablet de la urna (o según troqueles cortados, si aplica), 30 minutos después de iniciada la función"]
["4. Ingresar a la sala y contar el número de asistentes dentro de la sala 30 minutos después de iniciada la función y anotar en la columna \"Clientes Contados\""]
["5. Calcular y anotar la diferencia entre \"Clientes Contados\" y  los  \"Clientes Admitidos\" en la columna \"Diferencia Contados - Admitidos\""]
["6. El responsable del conteo del número de asistentes debe firmar en la columna \"Realizó Conteo\""]
[]
["Fecha","Sala","Horario","Clientes Admitidos","Clientes Contados","Diferencia\nContados-Admitidos","Realizó Conteo"]

{"sheet":"Firmas y Control documental","index":7,"n_rows":32,"n_cols":4,"rows_kept":32,"cut":false,"hidden":false,"merged":[[26,0,31,0],[26,1,26,2],[26,3,31,3],[27,1,27,2],[31,1,31,2],[28,1,28,2],[30,1,30,2],[29,1,29,2],[23,3,25,3],[7,0,7,3],[8,0,8,3],[9,0,9,3],[11,0,11,3],[13,0,13,1],[18,0,18,3],[25,1,25,2],[20,1,20,2],[21,1,21,2],[22,1,22,2],[23,0,25,0],[23,1,23,2],[24,1,24,2],[6,0,6,3],[1,0,1,3],[2,0,2,3],[3,0,3,3],[4,0,4,3],[5,0,5,3]]}
[]
["Revisión 03: 27 de enero de 2.022."]
["Cancela y sustituye: Documento \"Formatos de Control de Salas (Rev. 2)\", que contiene: Reporte de Inicio de Créditos AR-TRA-FT-RIC-02, Reporte Start y Finish AR-TRA-FT-RSF-02, Responsabilidades de Evacuación AR-TRA-FT-REV-02, Bitácora de Calidad en Salas AR-TRA-FT-BCS-02 y Bitácora de Control de Número de Asistentes y Calidad en Salas AR-TRA-FT-CAS-02, publicado el 26 de agosto de 2.021."]
[]
["SUS.Scanton US"]
["Cláusula de Confidencialidad"]
["Este documento y sus anexos contienen información estratégica de negocio, secretos comerciales y en general el know-how de KTR, LLC (“KTR”) y sus empresas filiales, derivados de experiencias comerciales y programas de investigación y desarrollo que han sido compilados para uso exclusivo de empresas filiales con el objetivo de asegurar e incrementar la rentabilidad y beneficio de KTR a largo plazo. El contenido de este documento y sus anexos es estrictamente confidencial y para el uso exclusivo de sus destinatarios."]
["En este documento y sus anexos tendrá la consideración de “Información Confidencial” toda documentación e información (de tipo económico, financiero, técnico, comercial, estratégico o de otro tipo) proporcionada mediante cualquier forma o medio (oral, escrita o en cualquier soporte) y en cualquier momento, ya sea con anterioridad o posterioridad a la fecha de este documento o sus anexos, que no esté disponible públicamente relativa a KTR o a cualquier sociedad filial y/o persona relacionada con las mismas, incluyendo, sin limitación, información científica, técnica o arquitectónica; información relativa al negocio actual o futuro, experiencia comercial y planes de comercialización, incluyendo, pero no limitada a, información financiera, términos contractuales o información y datos de clientes, diseños, dibujos, programas de computadora y software; costos e información de precios e identificación de personal u otros recursos para su posible uso comercial. En particular, será Información Confidencial toda documentación e información (i) marcada como tal; (ii) identificada por KTR o su personal, ya sea verbal o escrito, como Información Confidencial; (iii) que tenga valor comercial); (iv) que no sea conocida a nivel general en el mercado o la industria; o (v) que por su naturaleza o por las circunstancias en que se produzca la revelación, deba de buena fe estimarse como tal."]
["Los destinatarios de este documento y sus anexos se obligan a tratar en todo momento la Información Confidencial como secreta y confidencial, por tanto, no comunicarla ni revelarla directa o indirectamente, (verbal o escrita) a persona física o jurídica ajena a KTR sin que medie previa aprobación por escrito de KTR. La revelación, distribución, transmisión electrónica o copia de la Información Confidencial queda estrictamente prohibida. Los destinatarios de este documento y sus anexos acuerdan no duplicar, distribuir o revelar su contenido a través de ningún medio."]
[]
[]
["AUTORIZACIONES Y FIRMAS"]
[]
["NOMBRE",null,"PUESTO","RÚBRICA"]
["Elaboró","Rafael Moros","Consultor Jr. de Procesos Scanton"]
["V.° B.°","Inés Trementino","Gerente de Operaciones Cinépolis Argentna"]
["Autorizó","Iván Hurtado Santoyo","Gerente General Scanton"]
[]
["TABLA DE CAMBIOS"]
[]
{"$rows_left_out":12}