{"text_format":"1","workbook":"xlsx","n_sheets":12,"sheets":["Ejem. Retiros y Cortes Exh","Ejem. Retiros y Cortes Dul","Ejem. Parciales.","Formulario Llenado","Reporte Depósitos","Cajeros","Detalle Diario de Cajeros","Base de Datos Despachos Brinks","Detalle Despachos Brinks","Folios","Reporte Bolsas Brinks","Firmas y Control documental"],"not_rendered":{"charts":0,"images":12,"macros":1,"external_links":7,"defined_names":455,"comments":0,"pivot_tables":1},"unopened":[],"bounds":{"document_bytes":16777216,"sheet_cells":100000,"rows_first":2000,"rows_last":500,"rows_between":2000,"halvings":0,"cell_chars":16384,"cell_head_chars":4096},"cells_cut":0,"cells_raw":0,"read":"whole","date_system":"1900"}

{"sheet":"Ejem. Retiros y Cortes Exh","index":0,"n_rows":42,"n_cols":21,"rows_kept":42,"cut":false,"hidden":true,"merged":[[13,19,14,19],[41,2,41,5],[10,4,10,7],[13,2,13,5],[13,9,13,12],[37,2,37,5],[39,2,39,5],[40,2,40,5]]}
[]
[null,null,null,null,null,null,null,null,null,null,null,null,null,null,null,null,null,null,null,"Código F GNGS- 06"]
[]
[]
[]
[]
[]
[null,null,"Bitacora de Efectivo"]
[null,null,"\"Retiro y Cortes Exhibición \""]
[]
[null,null,null,"                                 Conjunto :","Plaza Morelia",null,null,null,null,null,null,"Fecha :","2011-03-08"]
[]
[]
[null,null,"Datos Vendedor",null,null,null,null,null,null,"Parciales (Depositos al cofre de valores)",null,null,null,"Total Parciales ",null,"Total Parciales  + Fondo",null,null,null,"Total General de \nIngresos de Exhibición en Efectivo "]
[null,null,"No.","Nombre","Turno ","Módulo",null,"Reintegro de Fondo de Caja",null,1,2,3,4,"Recibidos por Vendedor",null,"Recibidos por Vendedor",null,"Cheques"]
{"$rows_left_out":28}
{"sheet":"Ejem. Retiros y Cortes Dul","index":1,"n_rows":44,"n_cols":21,"rows_kept":44,"cut":false,"hidden":true,"merged":[[13,19,14,19],[41,2,41,5],[10,4,10,7],[13,2,13,5],[13,9,13,12],[37,2,37,5],[39,2,39,5],[40,2,40,5]]}
[]
[null,null,null,null,null,null,null,null,null,null,null,null,null,null,null,null,null,null,null,"Código F GNGS- 06"]
[]
[]
[]
[]
[]
[null,null,"Bitacora de Efectivo"]
[null,null,"\"Retiro y Cortes Dulcería \""]
[]
[null,null,null,"                                 Conjunto :","Plaza Morelia",null,null,null,null,null,null,"Fecha :","2011-03-08"]
[]
[]
[null,null,"Datos Vendedor",null,null,null,null,null,null,"Parciales (Depositos al cofre de valores)",null,null,null,"Total Parciales ",null,"Total Parciales  + Fondo",null,null,null,"Total General de \nIngresos de Dulcería en Efectivo "]
[null,null,"No.","Nombre","Turno ","Módulo",null,"Reintegro de Fondo de Caja",null,1,2,3,4,"Recibidos por Vendedor",null,"Recibidos por Vendedor",null,"Cheques "]
{"$rows_left_out":30}
{"sheet":"Ejem. Parciales.","index":2,"n_rows":77,"n_cols":20,"rows_kept":77,"cut":false,"hidden":true,"merged":[[9,3,9,6],[12,2,13,5],[12,8,12,15],[64,2,65,5],[67,2,67,5],[76,5,76,9],[76,14,76,16],[12,16,13,16],[15,2,15,5],[24,2,24,5],[44,12,44,16],[45,12,45,16],[69,2,69,5],[36,2,36,5],[40,2,40,5],[42,2,42,5],[38,2,38,5]]}
[]
[null,null,null,null,null,null,null,null,null,null,null,null,null,null,null,null,null,null,"Código F GNGS- 06"]
[]
[]
[]
[]
[null,null,"Bitacora de Efectivo"]
[null,null,"\" Parciales \""]
[]
[null,null,"Conjunto :","Cinépolis Morelia",null,null,null,null,null,null,null,null,"Fecha :",null,{"$f":"'Ejem. Retiros y Cortes Dul'!M11","v":"2011-03-08"}]
[]
[]
[null,null,"Denominaciones",null,null,null,null,null,"Parciales (Depositos al cofre de valores)",null,null,null,null,null,null,null,"Cheques "]
[null,null,null,null,null,null,null,null,1,null,2,null,3,null,4,null,null,null,"Total General"]
[]
{"$rows_left_out":63}
{"sheet":"Formulario Llenado","index":3,"n_rows":70,"n_cols":42,"rows_kept":70,"cut":false,"hidden":false,"merged":[[8,6,8,25],[0,2,4,30],[8,26,8,30],[68,2,69,4],[62,2,62,5],[64,2,64,5],[66,2,66,5],[8,2,8,3],[8,4,8,5],[64,26,64,27],[66,26,66,27]]}
[null,null,"Formulario de Recuperación de Fondos y Retiros",null,null,null,null,null,null,null,null,null,null,null,null,null,null,null,null,null,null,null,null,null,null,null,null,null,null,null,null,null,"Avellaneda",null,"Drops","Producto","Valor","Cantidad Lun-Jue","Total L-J","Cantidad Vie-Dom","Total V-D","Máximo Drop para el día"]
[null,null,null,null,null,null,null,null,null,null,null,null,null,null,null,null,null,null,null,null,null,null,null,null,null,null,null,null,null,null,null,null,"Houssay",null,"Box/Parking","Entrada General",690,60,{"$f":"+AK2*AL2","v":41400},90,{"$f":"+AK2*AN2","v":62100},{"$f":"+MAX(AM2,AO2)","v":62100}]
[null,null,null,null,null,null,null,null,null,null,null,null,null,null,null,null,null,null,null,null,null,null,null,null,null,null,null,null,null,null,null,null,"Luján",null,"Candy","Combo Mío",210,60,{"$f":"+AK3*AL3","v":12600},90,{"$f":"+AK3*AN3","v":18900},{"$f":"+MAX(AM3,AO3)","v":18900}]
[null,null,null,null,null,null,null,null,null,null,null,null,null,null,null,null,null,null,null,null,null,null,null,null,null,null,null,null,null,null,null,null,"Maipú",null,"Máximo",null,null,null,{"$f":"+MAX(AM2:AM3)","v":41400},null,{"$f":"+MAX(AO2:AO3)","v":62100},{"$f":"+MAX(AM4,AO4)","v":62100}]
[null,null,null,null,null,null,null,null,null,null,null,null,null,null,null,null,null,null,null,null,null,null,null,null,null,null,null,null,null,null,null,null,"Mendoza",null,0.85,null,null,null,null,null,null,{"$f":"+AP4*0.85","v":52785}]
[null,null,null,null,null,null,null,null,null,null,null,null,null,null,null,null,null,null,null,null,null,null,null,null,null,null,null,null,null,null,null,null,"Merlo",null,"Billete menor denominación que admite Compusafe ($)",null,null,null,null,null,null,10]
[null,null,null,null,null,"                                 Complejo :",null,null,"Fecha :",null,{"$f":"IF(J7=\"\",\"\",CHOOSE(WEEKDAY(J7,2),\"Lunes\",\"Martes\",\"Miércoles\",\"Jueves\",\"Viernes\",\"Sábado\",\"Domingo\"))","v":""},null,null,null,null,null,null,null,null,null,null,null,null,null,null,null,null,null,null,null,null,null,"Neuquén"]
[null,null,null,null,null,null,null,null,null,null,null,null,null,null,null,null,null,null,null,null,null,null,null,null,null,null,null,null,null,null,null,null,"Pilar"]
[null,null,"Datos Vendedor",null,"Float",null,"Barridos de Retiros (Drops)Depositados en Compusafe",null,null,null,null,null,null,null,null,null,null,null,null,null,null,null,null,null,null,null,"Total Parciales en Efectivo",null,null,null,null,null,"Recoleta"]
[null,null,"Legajo","Nombre","N°","Monto en $ Recuperado",1,2,3,4,5,6,7,8,9,10,11,12,13,14,15,16,17,18,"Drop Monedas/ Billetes Rechazados\nApertura","Drop Monedas/ Billetes Rechazados\nCierre","Recibidos por Vendedor","Recibidos Según\nVista Cashdesk","Faltante","Sobrante","Observaciones",null,"Rosario"]
[]
[null,null,null,{"$f":"IFERROR(IF(C12=\"\",\"\",VLOOKUP(C12,Cajeros!$B$4:$C$1425,2,FALSE)),\"                   ¡¡¡¡¡VERIFICAR LEGAJO!!!!!\")","v":""},null,null,null,null,null,null,null,null,null,null,null,null,null,null,null,null,null,null,null,null,null,null,{"$f":"SUM(G12:Z12)","v":0},null,{"$f":"IF(AB12=\"\",\"\",IF(AB12>AA12,ROUND(AB12-AA12,2),\"\"))","v":""},{"$f":"IF(AB12=\"\",\"\",IF(AB12<AA12,ROUND(AA12-AB12,2),\"\"))","v":""}]
[null,null,null,{"$f":"IFERROR(IF(C13=\"\",\"\",VLOOKUP(C13,Cajeros!$B$4:$C$1425,2,FALSE)),\"                   ¡¡¡¡¡VERIFICAR LEGAJO!!!!!\")","v":""},null,null,null,null,null,null,null,null,null,null,null,null,null,null,null,null,null,null,null,null,null,null,{"$f":"SUM(G13:Z13)","v":0},null,{"$f":"IF(AB13=\"\",\"\",IF(AB13>AA13,ROUND(AB13-AA13,2),\"\"))","v":""},{"$f":"IF(AB13=\"\",\"\",IF(AB13<AA13,ROUND(AA13-AB13,2),\"\"))","v":""}]
[null,null,null,{"$f":"IFERROR(IF(C14=\"\",\"\",VLOOKUP(C14,Cajeros!$B$4:$C$1425,2,FALSE)),\"                   ¡¡¡¡¡VERIFICAR LEGAJO!!!!!\")","v":""},null,null,null,null,null,null,null,null,null,null,null,null,null,null,null,null,null,null,null,null,null,null,0,null,"",""]
[null,null,null,{"$f":"IFERROR(IF(C15=\"\",\"\",VLOOKUP(C15,Cajeros!$B$4:$C$1425,2,FALSE)),\"                   ¡¡¡¡¡VERIFICAR LEGAJO!!!!!\")","v":""},null,null,null,null,null,null,null,null,null,null,null,null,null,null,null,null,null,null,null,null,null,null,0,null,{"$f":"IF(AB15=\"\",\"\",IF(AB15>AA15,ROUND(AB15-AA15,2),\"\"))","v":""},{"$f":"IF(AB15=\"\",\"\",IF(AB15<AA15,ROUND(AA15-AB15,2),\"\"))","v":""}]
{"$rows_left_out":56}
{"sheet":"Reporte Depósitos","index":4,"n_rows":34,"n_cols":52,"rows_kept":34,"cut":false,"hidden":false,"merged":[[29,9,29,13],[28,3,28,5],[0,2,4,51],[9,51,10,51],[13,2,13,5],[11,2,11,5],[15,2,15,5],[9,7,9,45],[17,2,17,5],[6,4,6,5],[34,2,48,51],[31,23,31,25],[29,23,29,25],[33,2,33,51],[9,49,10,49],[9,47,10,47],[23,17,23,51],[28,17,28,51],[22,2,22,51],[19,2,21,4],[26,23,26,25],[24,23,24,25],[24,3,24,5],[26,3,26,5],[29,3,31,5],[31,9,31,13]]}
[null,null,"Formulario de Depósitos en Compusafe"]
[]
[]
[]
[]
[]
[null,null,null,"Complejo:",{"$f":"IF('Formulario Llenado'!G7=\"\",\"\",'Formulario Llenado'!G7)","v":""},null,null,null,null,null,null,"Fecha :",null,{"$f":"+IF('Formulario Llenado'!J7=\"\",\"\",'Formulario Llenado'!J7)","v":""},null,{"$f":"'Formulario Llenado'!$K$7","v":""}]
[]
[]
[null,null,null,null,null,null,null,"Barridos de Retiros (Drops) Depositados en Compusafe",null,null,null,null,null,null,null,null,null,null,null,null,null,null,null,null,null,null,null,null,null,null,null,null,null,null,null,null,null,null,null,null,null,null,null,null,null,null,null,"Drop Final Cierre + Faltantes",null,"Sobrantes",null,"Total General"]
[null,null,null,null,null,null,null,1,null,2,null,3,null,4,null,5,null,6,null,7,null,8,null,9,null,10,null,11,null,12,null,13,null,14,null,15,null,16,null,17,null,18,null,"Drop Final\nApertura"]
[null,null,"Retiros de recaudación ($)",null,null,null,null,{"$f":"+IF('Formulario Llenado'!G65=\"\",0,'Formulario Llenado'!G65)","v":0},null,{"$f":"+IF('Formulario Llenado'!H65=\"\",0,'Formulario Llenado'!H65)","v":0},null,{"$f":"+IF('Formulario Llenado'!I65=\"\",0,'Formulario Llenado'!I65)","v":0},null,{"$f":"+IF('Formulario Llenado'!J65=\"\",0,'Formulario Llenado'!J65)","v":0},null,{"$f":"+IF('Formulario Llenado'!K65=\"\",0,'Formulario Llenado'!K65)","v":0},null,{"$f":"+IF('Formulario Llenado'!L65=\"\",0,'Formulario Llenado'!L65)","v":0},null,{"$f":"+IF('Formulario Llenado'!M65=\"\",0,'Formulario Llenado'!M65)","v":0},null,{"$f":"+IF('Formulario Llenado'!N65=\"\",0,'Formulario Llenado'!N65)","v":0},null,{"$f":"+IF('Formulario Llenado'!O65=\"\",0,'Formulario Llenado'!O65)","v":0},null,{"$f":"+IF('Formulario Llenado'!P65=\"\",0,'Formulario Llenado'!P65)","v":0},null,{"$f":"+IF('Formulario Llenado'!Q65=\"\",0,'Formulario Llenado'!Q65)","v":0},null,{"$f":"+IF('Formulario Llenado'!R65=\"\",0,'Formulario Llenado'!R65)","v":0},null,{"$f":"+IF('Formulario Llenado'!S65=\"\",0,'Formulario Llenado'!S65)","v":0},null,{"$f":"+IF('Formulario Llenado'!T65=\"\",0,'Formulario Llenado'!T65)","v":0},null,{"$f":"+IF('Formulario Llenado'!U65=\"\",0,'Formulario Llenado'!U65)","v":0},null,{"$f":"+IF('Formulario Llenado'!V65=\"\",0,'Formulario Llenado'!V65)","v":0},null,{"$f":"+IF('Formulario Llenado'!W65=\"\",0,'Formulario Llenado'!W65)","v":0},null,{"$f":"+IF('Formulario Llenado'!X65=\"\",0,'Formulario Llenado'!X65)","v":0},null,null,null,null,null,null,null,null,null,{"$f":"SUM(H12:AP12)","v":0}]
[]
[null,null,"Importe real depositado al Compusafe ($)",null,null,null,null,{"$f":"+IF('Formulario Llenado'!G63=\"\",0,'Formulario Llenado'!G63-'Formulario Llenado'!G65)","v":0},null,{"$f":"+IF('Formulario Llenado'!H63=\"\",0,'Formulario Llenado'!H63-'Formulario Llenado'!H65)","v":0},null,{"$f":"+IF('Formulario Llenado'!I63=\"\",0,'Formulario Llenado'!I63-'Formulario Llenado'!I65)","v":0},null,{"$f":"+IF('Formulario Llenado'!J63=\"\",0,'Formulario Llenado'!J63-'Formulario Llenado'!J65)","v":0},null,{"$f":"+IF('Formulario Llenado'!K63=\"\",0,'Formulario Llenado'!K63-'Formulario Llenado'!K65)","v":0},null,{"$f":"+IF('Formulario Llenado'!L63=\"\",0,'Formulario Llenado'!L63-'Formulario Llenado'!L65)","v":0},null,{"$f":"+IF('Formulario Llenado'!M63=\"\",0,'Formulario Llenado'!M63-'Formulario Llenado'!M65)","v":0},null,{"$f":"+IF('Formulario Llenado'!N63=\"\",0,'Formulario Llenado'!N63-'Formulario Llenado'!N65)","v":0},null,{"$f":"+IF('Formulario Llenado'!O63=\"\",0,'Formulario Llenado'!O63-'Formulario Llenado'!O65)","v":0},null,{"$f":"+IF('Formulario Llenado'!P63=\"\",0,'Formulario Llenado'!P63-'Formulario Llenado'!P65)","v":0},null,{"$f":"+IF('Formulario Llenado'!Q63=\"\",0,'Formulario Llenado'!Q63-'Formulario Llenado'!Q65)","v":0},null,{"$f":"+IF('Formulario Llenado'!R63=\"\",0,'Formulario Llenado'!R63-'Formulario Llenado'!R65)","v":0},null,{"$f":"+IF('Formulario Llenado'!S63=\"\",0,'Formulario Llenado'!S63-'Formulario Llenado'!S65)","v":0},null,{"$f":"+IF('Formulario Llenado'!T63=\"\",0,'Formulario Llenado'!T63-'Formulario Llenado'!T65)","v":0},null,{"$f":"+IF('Formulario Llenado'!U63=\"\",0,'Formulario Llenado'!U63-'Formulario Llenado'!U65)","v":0},null,{"$f":"+IF('Formulario Llenado'!V63=\"\",0,'Formulario Llenado'!V63-'Formulario Llenado'!V65)","v":0},null,{"$f":"+IF('Formulario Llenado'!W63=\"\",0,'Formulario Llenado'!W63-'Formulario Llenado'!W65)","v":0},null,{"$f":"+IF('Formulario Llenado'!X63=\"\",0,'Formulario Llenado'!X63-'Formulario Llenado'!X65)","v":0},null,{"$f":"+IF('Formulario Llenado'!Y65=\"\",\"\",'Formulario Llenado'!Y65)","v":""},null,null,null,{"$f":"+IF('Formulario Llenado'!AC65=\"\",\"\",'Formulario Llenado'!AC65)","v":""},null,{"$f":"+IF('Formulario Llenado'!AD63=\"\",0,'Formulario Llenado'!AD63)","v":0},null,{"$f":"SUM(H14:AV14)","v":0}]
[]
{"$rows_left_out":20}
{"sheet":"Cajeros","index":5,"n_rows":308,"n_cols":3,"rows_kept":308,"cut":false,"hidden":false,"merged":[]}
[]
[]
["Usuario","Legajo","Nombre"]
[40,40,"Luciano Barchetti"]
[182,182,"Claudia Nunez"]
[350,350,"Diego Daniel Gargarella"]
[373,373,"Roman Osvaldo Degrati"]
[425,425,"Nelson Feugeas"]
[427,427,"Alberto Jesus Ferreyra"]
[567,567,"Juan Fabricio Davyt"]
[578,578,"Gustavo Francisco Orejas"]
[637,637,"Rita Natalia Lopez"]
[643,643,"Marcos Javier Medrano"]
[1089,1089,"Gonzalo Benito"]
[1216,1216,"Diego Javier Solis"]
{"$rows_left_out":294}
{"sheet":"Detalle Diario de Cajeros","index":6,"n_rows":42,"n_cols":12,"rows_kept":42,"cut":false,"hidden":false,"merged":[[2,10,3,11]]}
["Fecha","Cajero","Legajo","Sobre diario","Origen","Importe","Justificación","Responsable de Ingresos y Valores Cierre","Detalle Retiro",null,null,{"$f":"IFERROR(IF(K1=\"\",\"\",VLOOKUP(K1,Cajeros!$B$4:$C$1425,2,FALSE)),\"VERIFICAR LEGAJO\")","v":""}]
[{"$f":"IF(F2=\"\",\"\",'Reporte Depósitos'!$N$7)","v":""},{"$f":"IF(F2=\"\",\"\",'Reporte Depósitos'!H21)","v":""},{"$f":"IF(F2=\"\",\"\",'Reporte Depósitos'!$H$22)","v":""},null,{"$f":"+IF(F2<>\"\",\"Cine\",\"\")","v":""},{"$f":"IF('Reporte Depósitos'!$H$14=0,\"\",'Reporte Depósitos'!$H$14)","v":""},null,{"$f":"+IF(F2=\"\",\"\",$L$1)","v":""},null,null,"Legajo","Nombre"]
[{"$f":"IF(F3=\"\",\"\",'Reporte Depósitos'!$N$7)","v":""},{"$f":"IF(F3=\"\",\"\",'Reporte Depósitos'!J21)","v":""},{"$f":"IF(F3=\"\",\"\",'Reporte Depósitos'!$J$22)","v":""},null,{"$f":"+IF(F3<>\"\",\"Cine\",\"\")","v":""},{"$f":"IF('Reporte Depósitos'!$J$14=0,\"\",'Reporte Depósitos'!$J$14)","v":""},null,{"$f":"+IF(F3=\"\",\"\",$L$1)","v":""},null,null,"Responsable de Ingresos y Valores Cierre"]
[{"$f":"IF(F4=\"\",\"\",'Reporte Depósitos'!$N$7)","v":""},{"$f":"IF(F4=\"\",\"\",'Reporte Depósitos'!L21)","v":""},{"$f":"IF(F4=\"\",\"\",'Reporte Depósitos'!$L$22)","v":""},null,"",{"$f":"IF('Reporte Depósitos'!$L$14=0,\"\",'Reporte Depósitos'!$L$14)","v":""},null,""]
[{"$f":"IF(F5=\"\",\"\",'Reporte Depósitos'!$N$7)","v":""},{"$f":"IF(F5=\"\",\"\",'Reporte Depósitos'!N21)","v":""},{"$f":"IF(F5=\"\",\"\",'Reporte Depósitos'!$N$22)","v":""},null,"",{"$f":"IF('Reporte Depósitos'!$N$14=0,\"\",'Reporte Depósitos'!$N$14)","v":""},null,""]
[{"$f":"IF(F6=\"\",\"\",'Reporte Depósitos'!$N$7)","v":""},{"$f":"IF(F6=\"\",\"\",'Reporte Depósitos'!P21)","v":""},{"$f":"IF(F6=\"\",\"\",'Reporte Depósitos'!$P$22)","v":""},null,"",{"$f":"IF('Reporte Depósitos'!$P$14=0,\"\",'Reporte Depósitos'!$P$14)","v":""},null,""]
[{"$f":"IF(F7=\"\",\"\",'Reporte Depósitos'!$N$7)","v":""},{"$f":"IF(F7=\"\",\"\",'Reporte Depósitos'!R21)","v":""},{"$f":"IF(F7=\"\",\"\",'Reporte Depósitos'!$R$22)","v":""},null,"",{"$f":"IF('Reporte Depósitos'!$R$14=0,\"\",'Reporte Depósitos'!$R$14)","v":""},null,""]
[{"$f":"IF(F8=\"\",\"\",'Reporte Depósitos'!$N$7)","v":""},{"$f":"IF(F8=\"\",\"\",'Reporte Depósitos'!T21)","v":""},{"$f":"IF(F8=\"\",\"\",'Reporte Depósitos'!$T$22)","v":""},null,"",{"$f":"IF('Reporte Depósitos'!$T$14=0,\"\",'Reporte Depósitos'!$T$14)","v":""},null,""]
[{"$f":"IF(F9=\"\",\"\",'Reporte Depósitos'!$N$7)","v":""},{"$f":"IF(F9=\"\",\"\",'Reporte Depósitos'!V21)","v":""},{"$f":"IF(F9=\"\",\"\",'Reporte Depósitos'!$V$22)","v":""},null,"",{"$f":"IF('Reporte Depósitos'!$V$14=0,\"\",'Reporte Depósitos'!$V$14)","v":""},null,""]
[{"$f":"IF(F10=\"\",\"\",'Reporte Depósitos'!$N$7)","v":""},{"$f":"IF(F10=\"\",\"\",'Reporte Depósitos'!X21)","v":""},{"$f":"IF(F10=\"\",\"\",'Reporte Depósitos'!$X$22)","v":""},null,"",{"$f":"IF('Reporte Depósitos'!$X$14=0,\"\",'Reporte Depósitos'!$X$14)","v":""},null,""]
[{"$f":"IF(F11=\"\",\"\",'Reporte Depósitos'!$N$7)","v":""},{"$f":"IF(F11=\"\",\"\",'Reporte Depósitos'!Z21)","v":""},{"$f":"IF(F11=\"\",\"\",'Reporte Depósitos'!$Z$22)","v":""},null,"",{"$f":"IF('Reporte Depósitos'!$Z$14=0,\"\",'Reporte Depósitos'!$Z$14)","v":""},null,""]
[{"$f":"IF(F12=\"\",\"\",'Reporte Depósitos'!$N$7)","v":""},{"$f":"IF(F12=\"\",\"\",'Reporte Depósitos'!AB21)","v":""},{"$f":"IF(F12=\"\",\"\",'Reporte Depósitos'!$AB$22)","v":""},null,"",{"$f":"IF('Reporte Depósitos'!$AB$14=0,\"\",'Reporte Depósitos'!$AB$14)","v":""},null,""]
[{"$f":"IF(F13=\"\",\"\",'Reporte Depósitos'!$N$7)","v":""},{"$f":"IF(F13=\"\",\"\",'Reporte Depósitos'!AD21)","v":""},{"$f":"IF(F13=\"\",\"\",'Reporte Depósitos'!$AD$22)","v":""},null,"",{"$f":"IF('Reporte Depósitos'!$AD$14=0,\"\",'Reporte Depósitos'!$AD$14)","v":""},null,""]
[{"$f":"IF(F14=\"\",\"\",'Reporte Depósitos'!$N$7)","v":""},{"$f":"IF(F14=\"\",\"\",'Reporte Depósitos'!AF21)","v":""},{"$f":"IF(F14=\"\",\"\",'Reporte Depósitos'!$AF$22)","v":""},null,"",{"$f":"IF('Reporte Depósitos'!$AF$14=0,\"\",'Reporte Depósitos'!$AF$14)","v":""},null,""]
[{"$f":"IF(F15=\"\",\"\",'Reporte Depósitos'!$N$7)","v":""},{"$f":"IF(F15=\"\",\"\",'Reporte Depósitos'!AH21)","v":""},{"$f":"IF(F15=\"\",\"\",'Reporte Depósitos'!$AH$22)","v":""},null,"",{"$f":"IF('Reporte Depósitos'!$AH$14=0,\"\",'Reporte Depósitos'!$AH$14)","v":""},null,""]
{"$rows_left_out":28}
{"sheet":"Base de Datos Despachos Brinks","index":7,"n_rows":6336,"n_cols":9,"rows_kept":6336,"cut":false,"hidden":false,"merged":[]}
["Fecha","Cajero","Legajo","Sobre diario","Origen","Importe","Justificación","Responsable de Ingresos y Valores","Detalle Retiro"]
["2019-12-26","Cecilia Savino",8898,959615,"Cine",42152,null,"Cecilia Savino"]
["2019-12-26","Carla Noemi Lopez",2814,959606,"Cine",40389,null,"Cecilia Savino"]
["2019-12-26","Cecilia Savino",8898,959613,"Cine",33427.5,null,"Cecilia Savino"]
["2019-12-26","Cecilia Savino",8898,959612,"Cine",15709,null,"Cecilia Savino"]
["2019-12-26","Cecilia Savino",8898,959608,"Cine",13060,null,"Cecilia Savino"]
["2019-12-26","Cecilia Savino",8898,959616,"Cine",322,null,"Cecilia Savino"]
["2019-12-26","Carla Noemi Lopez",2814,null,"Retiro",5000,null,"Cecilia Savino"]
["2019-12-27","Laura Giselle Enriquez",6885,959605,"Cine",59967,null,"Geraldine Selene Obregon Alvarez"]
["2019-12-27","Laura Giselle Enriquez",6885,959610,"Cine",45350,null,"Geraldine Selene Obregon Alvarez"]
["2019-12-27","Laura Giselle Enriquez",6885,959603,"Cine",34100.5,null,"Geraldine Selene Obregon Alvarez"]
["2019-12-27","Geraldine Selene Obregon Alvarez",10112,959611,"Cine",21882,null,"Geraldine Selene Obregon Alvarez"]
["2019-12-27","Nahuel Alejandro Miño",7872,959227,"Cine",5890,null,"Geraldine Selene Obregon Alvarez"]
["2019-12-27","Geraldine Selene Obregon Alvarez",10112,959604,"Cine",13.5,null,"Geraldine Selene Obregon Alvarez"]
[]
{"$rows_left_out":6322}
{"sheet":"Detalle Despachos Brinks","index":8,"n_rows":3,"n_cols":7,"rows_kept":3,"cut":false,"hidden":false,"merged":[]}
["Fecha","Entrega","N° Bolsines","Importe","Fecha Brinks","Bolsa","Centenas Cambio"]
["2019-12-27","Parcial",0,0]
["2019-12-27","Final",6,167203,"2019-12-30"]

{"sheet":"Folios","index":9,"n_rows":17,"n_cols":8,"rows_kept":17,"cut":false,"hidden":true,"merged":[]}
[]
[]
[null,"Parcial",null,"Folio",null,"Importe"]
[]
[null,1,null,881492,null,{"$f":"'Reporte Depósitos'!H14","v":0}]
[]
[null,2,null,{"$f":"'Reporte Depósitos'!J16","v":""},null,{"$f":"'Reporte Depósitos'!J14","v":0}]
[]
[null,3,null,{"$f":"'Reporte Depósitos'!L16","v":""},null,{"$f":"'Reporte Depósitos'!L14","v":0}]
[]
[null,4,null,{"$f":"'Reporte Depósitos'!N16","v":""},null,{"$f":"'Reporte Depósitos'!N14","v":0}]
[]
[null,5,null,{"$f":"'Reporte Depósitos'!P16","v":""},null,{"$f":"'Reporte Depósitos'!P14","v":0}]
[]
[null,6,null,{"$f":"'Reporte Depósitos'!X16","v":""},null,{"$f":"'Reporte Depósitos'!X14","v":0}]
{"$rows_left_out":3}
{"sheet":"Reporte Bolsas Brinks","index":10,"n_rows":7,"n_cols":5,"rows_kept":7,"cut":false,"hidden":false,"merged":[]}
[null,null,null,"Valores"]
["Fecha Brinks","Bolsa","Fecha","Suma de N° Bolsines","Suma de Importe"]
["(blank)","(blank)","(blank)"]
[null,null,"2019-12-27",0,0]
[null,"(blank) Total",null,0,0]
["2019-12-30","(blank)","2019-12-27",6,167203]
[null,"(blank) Total",null,6,167203]

{"sheet":"Firmas y Control documental","index":11,"n_rows":36,"n_cols":4,"rows_kept":36,"cut":false,"hidden":false,"merged":[[35,0,36,0],[35,1,36,2],[35,3,36,3],[19,0,19,3],[1,0,1,3],[2,0,2,3],[3,0,3,3],[4,0,4,3],[5,0,5,3],[6,0,6,3],[7,0,7,3],[8,0,8,3],[9,0,9,3],[11,0,11,3],[13,0,13,1],[26,0,34,0],[26,1,34,2],[26,3,34,3],[21,1,21,2],[22,0,23,0],[22,1,23,2],[22,3,23,3],[24,0,25,0],[24,1,25,2],[24,3,25,3]]}
[]
["Revisión 03: 29 de Diciembre de 2.021."]
["Cancela y sustituye: Formulario de Recuperación de Fondos y Retiros. Formulario de Depósitos en Compusafe AR-TRA-FT-DRO-02, publicado el 11 de diciembre de 2.020."]
[]
["SUS.Scanton US"]
["Cláusula de Confidencialidad"]
["Este documento y sus anexos contienen información estratégica de negocio, secretos comerciales y en general el know-how de KTR, LLC (“KTR”) y sus empresas filiales, derivados de experiencias comerciales y programas de investigación y desarrollo que han sido compilados para uso exclusivo de empresas filiales con el objetivo de asegurar e incrementar la rentabilidad y beneficio de KTR a largo plazo. El contenido de este documento y sus anexos es estrictamente confidencial y para el uso exclusivo de sus destinatarios."]
["En este documento y sus anexos tendrá la consideración de “Información Confidencial” toda documentación e información (de tipo económico, financiero, técnico, comercial, estratégico o de otro tipo) proporcionada mediante cualquier forma o medio (oral, escrita o en cualquier soporte) y en cualquier momento, ya sea con anterioridad o posterioridad a la fecha de este documento o sus anexos, que no esté disponible públicamente relativa a KTR o a cualquier sociedad filial y/o persona relacionada con las mismas, incluyendo, sin limitación, información científica, técnica o arquitectónica; información relativa al negocio actual o futuro, experiencia comercial y planes de comercialización, incluyendo, pero no limitada a, información financiera, términos contractuales o información y datos de clientes, diseños, dibujos, programas de computadora y software; costos e información de precios e identificación de personal u otros recursos para su posible uso comercial. En particular, será Información Confidencial toda documentación e información (i) marcada como tal; (ii) identificada por KTR o su personal, ya sea verbal o escrito, como Información Confidencial; (iii) que tenga valor comercial); (iv) que no sea conocida a nivel general en el mercado o la industria; o (v) que por su naturaleza o por las circunstancias en que se produzca la revelación, deba de buena fe estimarse como tal."]
["Los destinatarios de este documento y sus anexos se obligan a tratar en todo momento la Información Confidencial como secreta y confidencial, por tanto, no comunicarla ni revelarla directa o indirectamente, (verbal o escrita) a persona física o jurídica ajena a KTR sin que medie previa aprobación por escrito de KTR. La revelación, distribución, transmisión electrónica o copia de la Información Confidencial queda estrictamente prohibida. Los destinatarios de este documento y sus anexos acuerdan no duplicar, distribuir o revelar su contenido a través de ningún medio."]
[]
[]
["AUTORIZACIONES Y FIRMAS"]
[]
["NOMBRE",null,"PUESTO","RÚBRICA"]
["Elaboró","Rafael Moros","Consultor Jr. de Procesos Scanton"]
{"$rows_left_out":21}